Target
Carbonic anhydrase 1
Ligand
BDBM248147
Substrate
Meas. Tech.
CA Inhibition Assay
pH
7.4±n/a
Temperature
298.15±n/a K
Ki
17900±n/a nM
Comments
extracted
Citation
 Bilginer, SUnluer, EGul, HIMete, EIsik, SVullo, DOzensoy-Guler, OBeyaztas, SCapasso, CSupuran, CT Carbonic anhydrase inhibitors. Phenols incorporating 2- or 3-pyridyl-ethenylcarbonyl and tertiary amine moieties strongly inhibit Saccharomyces cerevisiae ß-carbonic anhydrase. J Enzyme Inhib Med Chem 29:495-9 (2014)  
Target
Name:
Carbonic anhydrase 1
Synonyms:
CA-I CAB Carbonate dehydratase I Carbonic anhydrase 1 (CA I) Carbonic anhydrase 1 (Recombinant CA I) Carbonic anhydrase B Carbonic anhydrase I (CA I) Carbonic anhydrase I (CAI) Carbonic anhydrase isoenzyme I (hCA I) | hCA
Type:
Enzyme
Mol. Mass.:
28873.37
Organism:
Homo sapiens (Human)
Description:
P00915
Residue:
261
  
Inhibitor
Name:
BDBM248147
Synonyms:
CA standard inhibitor, 6
Type:
Small organic molecule
Emp. Form.:
C20H22N2O2
Mol. Mass.:
322.4009
SMILES:
Oc1ccc(cc1CN1CCCCC1)C(=O)\C=C\c1cccnc1
: