Target
Carbonic anhydrase [110-330]
Ligand
BDBM92964
Substrate
Meas. Tech.
Stopped Flow CO2 Hydration Assay
pH
8.3±n/a
Temperature
293.15±n/a K
Ki
93000±n/a nM
Citation
 Dathan, NAAlterio, VTroiano, EVullo, DLudwig, MDe Simone, GSupuran, CTMonti, SM Biochemical characterization of the chloroplastic ß-carbonic anhydrase from Flaveria bidentis (L.) "Kuntze". J Enzyme Inhib Med Chem 29:500-4 (2014)  
Target
Name:
Carbonic anhydrase [110-330]
Synonyms:
CAHX_FLABI | Carbonic anhydrase (CA1)
Type:
Enzyme
Mol. Mass.:
24226.97
Organism:
Flaveria bidentis (Coastal plain yellowtops)
Description:
Truncated version without chloroplast transit peptide (1-109)
Residue:
221
  
Inhibitor
Name:
BDBM92964
Synonyms:
CHEMBL182928 | Oxalate
Type:
Small molecule
Emp. Form.:
C2O4
Mol. Mass.:
88.0201
SMILES:
[O-]C(=O)C([O-])=O
: