Target
Secreted chorismate mutase
Ligand
BDBM248168
Substrate
Meas. Tech.
CM Assay
pH
7.5±0
Temperature
310.15±0 K
IC50
1.37e+4± 1.9e+3 nM
Citation
 Alokam, RJeankumar, VUSridevi, JPMatikonda, SSPeddi, SAlvala, MYogeeswari, PSriram, D Identification and structure-activity relationship study of carvacrol derivatives as Mycobacterium tuberculosis chorismate mutase inhibitors. J Enzyme Inhib Med Chem 29:547-54 (2014)  
Target
Name:
Secreted chorismate mutase
Synonyms:
Chorismate mutase (CM) Chorismate mutase-related protein | SCMU_MYCTU
Type:
Protein
Mol. Mass.:
21942.03
Organism:
Mycobacterium tuberculosis H37Rv
Description:
Residue:
199
  
Inhibitor
Name:
BDBM248168
Synonyms:
Carvacrol derivative, 15
Type:
Small organic molecule
Emp. Form.:
C10H13ClO
Mol. Mass.:
184.663
SMILES:
CC(C)c1cc(O)c(C)cc1Cl
: