Target
Beta-secretase 2
Ligand
BDBM249090
Substrate
Meas. Tech.
Time-Resolved Endpoint Proteolysis Assay
pH
5±n/a
Temperature
303.15±n/a K
Ki
6.2±n/a nM
Comments
extracted
Citation
 Gilbert, EJCumming, JNScott, JDWu, WBurnett, DAStamford, AW C2-azaspiro iminothiazine dioxides as BACE inhibitors, compositions, and their use US Patent  US9453034 Publication Date 9/27/2016 
Target
Name:
Beta-secretase 2
Synonyms:
AEPLC ASP1 Asp 1 Aspartyl protease 1 BACE2_HUMAN Beta-secretase (BACE) Beta-secretase 2 (BACE-2) Beta-site APP-cleaving enzyme 2 Memapsin-1 beta-Secretase (BACE-2)
Type:
Protein
Mol. Mass.:
56171.20
Organism:
Homo sapiens (Human)
Description:
Q9Y5Z0
Residue:
518
  
Inhibitor
Name:
BDBM249090
Synonyms:
US9453034, 4
Type:
Small organic molecule
Emp. Form.:
C20H23FN6O4S
Mol. Mass.:
462.498
SMILES:
COc1cnc(cn1)C(=O)Nc1ccc(F)c(c1)[C@]1(C)CS(=O)(=O)C2(CN(C)C2)C(=N)N1
: