Target
Hexokinase-4
Ligand
BDBM249127
Substrate
Meas. Tech.
Glucokinase-Activating Assay
Temperature
303.15±n/a K
EC50
21.8±n/a nM
Comments
extracted
Citation
 Lin, SZhang, RCampbell, BDewnani, SVXu, JXu, LParmee, ERKats-Kagan, R Glucokinase activator compounds, compositions containing such compounds, and methods of treatment US Patent  US9453038 Publication Date 9/27/2016 
Target
Name:
Hexokinase-4
Synonyms:
GCK Glucokinase (GK) HK IV HXK4_HUMAN Hexokinase-D
Type:
Enzyme
Mol. Mass.:
52175.81
Organism:
Homo sapiens (Human)
Description:
P35557
Residue:
465
  
Inhibitor
Name:
BDBM249127
Synonyms:
US9453038, 4
Type:
Small organic molecule
Emp. Form.:
C29H26F3N3O4
Mol. Mass.:
537.5296
SMILES:
COC(=O)CCc1ccc(Oc2cc3cc([nH]c3cc2C2CCC(=O)N2C)-c2ccc(cn2)C(F)(F)F)cc1
: