Target
Hexokinase-4
Ligand
BDBM249151
Substrate
Meas. Tech.
Glucokinase-Activating Assay
Temperature
303.15±n/a K
EC50
234.1±n/a nM
Comments
extracted
Citation
 Lin, SZhang, RCampbell, BDewnani, SVXu, JXu, LParmee, ERKats-Kagan, R Glucokinase activator compounds, compositions containing such compounds, and methods of treatment US Patent  US9453038 Publication Date 9/27/2016 
Target
Name:
Hexokinase-4
Synonyms:
GCK Glucokinase (GK) HK IV HXK4_HUMAN Hexokinase-D
Type:
Enzyme
Mol. Mass.:
52175.81
Organism:
Homo sapiens (Human)
Description:
P35557
Residue:
465
  
Inhibitor
Name:
BDBM249151
Synonyms:
US9453038, 29
Type:
Small organic molecule
Emp. Form.:
C26H24N4O3S
Mol. Mass.:
472.559
SMILES:
CN1C(CCC1=O)c1cc2[nH]c(cc2cc1Sc1ccccn1)-c1ccc(CCC(O)=O)cn1
: