Target
Hexokinase-4
Ligand
BDBM249153
Substrate
Meas. Tech.
Glucokinase-Activating Assay
Temperature
303.15±n/a K
EC50
68.8±n/a nM
Comments
extracted
Citation
 Lin, SZhang, RCampbell, BDewnani, SVXu, JXu, LParmee, ERKats-Kagan, R Glucokinase activator compounds, compositions containing such compounds, and methods of treatment US Patent  US9453038 Publication Date 9/27/2016 
Target
Name:
Hexokinase-4
Synonyms:
GCK Glucokinase (GK) HK IV HXK4_HUMAN Hexokinase-D
Type:
Enzyme
Mol. Mass.:
52175.81
Organism:
Homo sapiens (Human)
Description:
P35557
Residue:
465
  
Inhibitor
Name:
BDBM249153
Synonyms:
US9453038, 31
Type:
Small organic molecule
Emp. Form.:
C25H24N4O6S2
Mol. Mass.:
540.611
SMILES:
CN1C(CCC1=O)c1cc2[nH]c(cc2cc1Oc1ccc(nc1)S(C)(=O)=O)-c1ncc(CCC(O)=O)s1
: