Target
E3 ubiquitin-protein ligase XIAP [241-356]
Ligand
BDBM249169
Substrate
Meas. Tech.
Fluorescence Polarization Assay
Temperature
298.15±n/a K
IC50
0.06±n/a nM
Comments
extracted
Citation
 Borzilleri, RMPerez, HLWei, DDKim, KS IAP antagonists US Patent  US9453048 Publication Date 9/27/2016 
Target
Name:
E3 ubiquitin-protein ligase XIAP [241-356]
Synonyms:
API3 BIRC4 E3 ubiquitin-protein ligase XIAP BIR-3 IAP3 X-linked inhibitor of apoptosis protein BIR3 domain (XIAP BIR-3) XIAP-BIR3 baculovirus IAP repeat 3 (BIR3) domain of XIAP
Type:
Protein Binding Domain
Mol. Mass.:
13276.62
Organism:
Homo sapiens (Human)
Description:
BIR3 of XIAP: RESIDUES 241-356.
Residue:
116
  
Inhibitor
Name:
BDBM249169
Synonyms:
US9453048, 11 | US9453048, 12
Type:
Small organic molecule
Emp. Form.:
C63H82N8O8
Mol. Mass.:
1079.374
SMILES:
CN[C@@H](C)C(=O)NC(Cc1ccc(OCc2ccc(cc2)C(=O)N[C@H]2CC(N(C2)C(=O)[C@@H](NC(=O)[C@H](C)NC)C(C)(C)C)C(=O)N[C@@H]2CCCc3ccccc23)cc1)C(=O)C1CCCC[C@@H]1C(=O)NC1CCCc2ccccc12
: