Target
E3 ubiquitin-protein ligase XIAP [241-356]
Ligand
BDBM249171
Substrate
Meas. Tech.
Fluorescence Polarization Assay
Temperature
298.15±n/a K
IC50
0.23±n/a nM
Comments
extracted
Citation
 Borzilleri, RMPerez, HLWei, DDKim, KS IAP antagonists US Patent  US9453048 Publication Date 9/27/2016 
Target
Name:
E3 ubiquitin-protein ligase XIAP [241-356]
Synonyms:
API3 BIRC4 E3 ubiquitin-protein ligase XIAP BIR-3 IAP3 X-linked inhibitor of apoptosis protein BIR3 domain (XIAP BIR-3) XIAP-BIR3 baculovirus IAP repeat 3 (BIR3) domain of XIAP
Type:
Protein Binding Domain
Mol. Mass.:
13276.62
Organism:
Homo sapiens (Human)
Description:
BIR3 of XIAP: RESIDUES 241-356.
Residue:
116
  
Inhibitor
Name:
BDBM249171
Synonyms:
US9453048, 13 | US9453048, 15
Type:
Small organic molecule
Emp. Form.:
C61H79N9O8
Mol. Mass.:
1066.3355
SMILES:
CN[C@@H](C)C(=O)N[C@H](C(=O)N1C[C@H](CC1C(=O)N[C@@H]1CCCc2ccccc12)NC(=O)c1ccc(COc2ccc(CN(NC(=O)[C@H](C)NC)C(=O)C3CCC[C@H]3C(=O)NC3CCCc4ccccc34)cc2)cc1)C(C)(C)C
: