Target
E3 ubiquitin-protein ligase XIAP [124-240]
Ligand
BDBM249171
Substrate
Meas. Tech.
AlphaScreen Assay
Temperature
298.15±n/a K
IC50
2.00±n/a nM
Comments
extracted
Citation
 Borzilleri, RMPerez, HLWei, DDKim, KS IAP antagonists US Patent  US9453048 Publication Date 9/27/2016 
Target
Name:
E3 ubiquitin-protein ligase XIAP [124-240]
Synonyms:
6x Histidine-tagged BIR2 domain BIR2 (aa 124-240) E3 ubiquitin-protein ligase (XIAP-BIR2)(C202A/C213G) XIAP XIAP_HUMAN | amino acids 124-240 of XIAP
Type:
Enzyme Catalytic Domain
Mol. Mass.:
13562.46
Organism:
Homo sapiens (Human)
Description:
P98170[124-240]
Residue:
117
  
Inhibitor
Name:
BDBM249171
Synonyms:
US9453048, 13 | US9453048, 15
Type:
Small organic molecule
Emp. Form.:
C61H79N9O8
Mol. Mass.:
1066.3355
SMILES:
CN[C@@H](C)C(=O)N[C@H](C(=O)N1C[C@H](CC1C(=O)N[C@@H]1CCCc2ccccc12)NC(=O)c1ccc(COc2ccc(CN(NC(=O)[C@H](C)NC)C(=O)C3CCC[C@H]3C(=O)NC3CCCc4ccccc34)cc2)cc1)C(C)(C)C
: