Target
Cytochrome P450 11B1, mitochondrial
Ligand
BDBM249229
Substrate
Meas. Tech.
G402-Based Assay
EC50
0.9±n/a nM
Citation
 Aebi, JAmrein, KHornsperger, BKuhn, BMaerki, HPMayweg, AVTan, X Dihydroquinoline-2-one derivatives US Patent  US9458135 Publication Date 10/4/2016 
Target
Name:
Cytochrome P450 11B1, mitochondrial
Synonyms:
C11B1_HUMAN CYPXIB1 Cytochrome P450 11B1 Cytochrome P450 11B1, mitochondrial | S11BH
Type:
Enzyme
Mol. Mass.:
57591.44
Organism:
Homo sapiens (Human)
Description:
P15538
Residue:
503
  
Inhibitor
Name:
BDBM249229
Synonyms:
US9458135, 17
Type:
Small organic molecule
Emp. Form.:
C22H18N4O2
Mol. Mass.:
370.4039
SMILES:
CN1C(=O)CCc2cc(ccc12)-c1cncc(COc2cc(ccn2)C#N)c1
: