Target
Cyclin-A2/Cyclin-dependent kinase 2
Ligand
BDBM6629
Substrate
S1 peptide
Meas. Tech.
Tyrosine Kinase Assay
IC50
12000±n/a nM
Citation
 Honma, TYoshizumi, THashimoto, NHayashi, KKawanishi, NFukasawa, KTakaki, TIkeura, CIkuta, MSuzuki-Takahashi, IHayama, TNishimura, SMorishima, H A novel approach for the development of selective Cdk4 inhibitors: library design based on locations of Cdk4 specific amino acid residues. J Med Chem 44:4628-40 (2001)  
Target
Name:
Cyclin-A2/Cyclin-dependent kinase 2
Synonyms:
CDK2-CyclinA CDK2/Cyclin A Cyclin A2/dependent kinase 2 Cyclin-Dependent Kinase 2 (CDK2A)
Type:
Protein Complex
Mol. Mass.:
Description:
Cdk2/Cyclin A kinase was purified from insect cells coinfected with Cyclin A/Cdk2 baculovirus.
Components:
This complex has 2 components.
Component 1
Name:
Cyclin-dependent kinase 2
Synonyms:
CDK2 CDK2_HUMAN Cell division protein kinase 2 Protein cereblon/Cyclin-dependent kinase 2 | p33 protein kinase
Type:
Enzyme Subunit
Mol. Mass.:
33938.17
Organism:
Homo sapiens (Human)
Description:
P24941
Residue:
298
  
Component 2
Name:
Cyclin-A2
Synonyms:
CCN1 CCNA1 CCNA2_HUMAN Cyclin-A
Type:
Enzyme Subunit
Mol. Mass.:
48550.19
Organism:
Homo sapiens (Human)
Description:
P20248
Residue:
432
  
Inhibitor
Name:
BDBM6629
Synonyms:
1-{5-oxo-1H,2H,3H,5H,9bH-benzo[a]pyrrolizin-9-yl}-3-[5-(piperidin-1-ylmethyl)-1H-pyrazol-3-yl]urea N-(5-Oxo-2,3,5,9b-tetrahydro-1H-pyrrolo[2,1-a]isoindol-9-yl)-N -[5-(piperidin-1-ylmethyl)-1H-pyrazol-3-yl]urea
Type:
Small organic molecule
Emp. Form.:
C21H26N6O2
Mol. Mass.:
394.4701
SMILES:
O=C(Nc1cc(CN2CCCCC2)n[nH]1)Nc1cccc2C(=O)N3CCCC3c12
:
Substrate
Name:
S1 peptide
Synonyms:
Type:
Peptide
Mol. Mass.:
1333.73
Organism:
Description:
50 uM ATP (0.5-1.5 uCi of [33P]-ATP (3000 Ci/mmol)) as co-substrate.
Residue:
12
AKAKKTPKKAKK