Target
Bromodomain-containing protein 4 [75-147]
Ligand
BDBM249277
Substrate
Meas. Tech.
Amplified Luminescent Proximity Homogeneous Assay (ALPHA)
pH
7.5±n/a
Temperature
298.15±n/a K
IC50
14.4±n/a nM
Comments
extracted
Citation
 Aktoudianakis, EChin, GCorkey, BKDu, JElbel, KJiang, RHKobayashi, TLee, RMartinez, RMetobo, SEMish, MMunoz, MShevick, SSperandio, DYang, HZablocki, J Benzimidazole derivatives as bromodomain inhibitors US Patent  US9458145 Publication Date 10/4/2016 
Target
Name:
Bromodomain-containing protein 4 [75-147]
Synonyms:
BRD4 Bromo domain 1 Bromodomain-containing protein 4 (BRD4) Bromo 1 Bromodomain-containing protein 4 (BRD4)(Bromo 1) Bromodomain-containing protein 4 Bromodomain 1 (BRD4-1) HUNK1
Type:
Mol. Mass.:
8856.55
Organism:
Homo sapiens (Human)
Description:
BD1 (75-147 aa) of O60885
Residue:
73
  
Inhibitor
Name:
BDBM249277
Synonyms:
US10017501, Compound 1020-18 | US9458145, 1020-18
Type:
Small organic molecule
Emp. Form.:
C25H22N4O
Mol. Mass.:
394.4684
SMILES:
Cc1noc(C)c1-c1cc(-c2c(C)ccc3ncccc23)c2[nH]c(nc2c1)C1CC1
: