Target
Bromodomain-containing protein 4 [75-147]
Ligand
BDBM249301
Substrate
Meas. Tech.
Amplified Luminescent Proximity Homogeneous Assay (ALPHA)
pH
7.5±n/a
Temperature
298.15±n/a K
IC50
512.9±n/a nM
Comments
extracted
Citation
 Aktoudianakis, EChin, GCorkey, BKDu, JElbel, KJiang, RHKobayashi, TLee, RMartinez, RMetobo, SEMish, MMunoz, MShevick, SSperandio, DYang, HZablocki, J Benzimidazole derivatives as bromodomain inhibitors US Patent  US9458145 Publication Date 10/4/2016 
Target
Name:
Bromodomain-containing protein 4 [75-147]
Synonyms:
BRD4 Bromo domain 1 Bromodomain-containing protein 4 (BRD4) Bromo 1 Bromodomain-containing protein 4 (BRD4)(Bromo 1) Bromodomain-containing protein 4 Bromodomain 1 (BRD4-1) HUNK1
Type:
Mol. Mass.:
8856.55
Organism:
Homo sapiens (Human)
Description:
BD1 (75-147 aa) of O60885
Residue:
73
  
Inhibitor
Name:
BDBM249301
Synonyms:
US10017501, Compound 1020-136 | US9458145, 1020-136
Type:
Small organic molecule
Emp. Form.:
C20H22N4O2
Mol. Mass.:
350.4143
SMILES:
CC1CCC(=O)N1c1cc(cc2[nH]c(nc12)C1CC1)-c1c(C)noc1C
: