Target
Bromodomain-containing protein 4 [368-440]
Ligand
BDBM249310
Substrate
Meas. Tech.
Ligand KI Assay
pH
7.5±n/a
Temperature
298.15±n/a K
IC50
20.2±n/a nM
Comments
extracted
Citation
 Aktoudianakis, EChin, GCorkey, BKDu, JElbel, KJiang, RHKobayashi, TLee, RMartinez, RMetobo, SEMish, MMunoz, MShevick, SSperandio, DYang, HZablocki, J Benzimidazole derivatives as bromodomain inhibitors US Patent  US9458145 Publication Date 10/4/2016 
Target
Name:
Bromodomain-containing protein 4 [368-440]
Synonyms:
BRD4 Bromo domain 2 Bromodomain-containing protein 4 (BRD4) Bromo 2 Bromodomain-containing protein 4 (BRD4)(Bromo 2) Bromodomain-containing protein 4 Bromodomain 2 (BRD4-2) HUNK1
Type:
Protein
Mol. Mass.:
8564.63
Organism:
Homo sapiens (Human)
Description:
BD2 (368-440 aa) of O60885
Residue:
73
  
Inhibitor
Name:
BDBM249310
Synonyms:
US10017501, Compound 1020-224 | US9458145, 1020-224
Type:
Small organic molecule
Emp. Form.:
C26H22FN5O2
Mol. Mass.:
455.4836
SMILES:
Cc1noc(C)c1-c1cc(c2nc([nH]c2c1F)C1CC1)C(O)(c1ccccn1)c1ccccn1
: