Target
Histone deacetylase 6
Ligand
BDBM249364
Substrate
Meas. Tech.
Enzyme Assay
pH
7.4±n/a
Temperature
298.15±n/a K
IC50
2.9±n/a nM
Comments
extracted
Citation
 Mazitschek, Rvan Duzer, JH Pyrimidine hydroxy amide compounds as HDAC6 selective inhibitors US Patent  US9464073 Publication Date 10/11/2016 
Target
Name:
Histone deacetylase 6
Synonyms:
Cereblon/Histone deacetylase 6 HDAC6 Histone deacetylase 6 (HDAC6) KIAA0901 | ORF Names:JM21
Type:
Chromatin regulator; hydrolase; repressor
Mol. Mass.:
131381.51
Organism:
Homo sapiens (Human)
Description:
Q9UBN7
Residue:
1215
  
Inhibitor
Name:
BDBM249364
Synonyms:
US9464073, 001 | US9884850, Compound 1
Type:
Small organic molecule
Emp. Form.:
C17H18F2N4O2
Mol. Mass.:
348.3472
SMILES:
ONC(=O)c1cnc(NC2(CCCCC2)c2cc(F)cc(F)c2)nc1
: