Target
Complement factor D
Ligand
BDBM249369
Substrate
Meas. Tech.
In Vitro Assay
pH
7.5±n/a
Temperature
298.15±n/a K
IC50
35±n/a nM
Comments
extracted
Citation
 Flohr, SHommel, ULorthiois, ELMaibaum, JKOstermann, NQuancard, JRandl, SARogel, OVulpetti, A Pyrrolidine derivatives and their use as complement pathway modulators US Patent  US9464081 Publication Date 10/11/2016 
Target
Name:
Complement factor D
Synonyms:
Adipsin CFAD_HUMAN DF Properdin factor D
Type:
Protein
Mol. Mass.:
27039.19
Organism:
Homo sapiens (Human)
Description:
P00746
Residue:
253
  
Inhibitor
Name:
BDBM249369
Synonyms:
US9464081, 2
Type:
Small organic molecule
Emp. Form.:
C21H24FN5O3
Mol. Mass.:
413.4454
SMILES:
[#6]\[#6](-[#6])=[#6](/F)-[#6]-[#7]-[#6](=O)-[#6@@H]-1-[#6]-[#6@H]-2-[#6]-[#6@H]-2-[#7]-1-[#6](=O)-[#6]-n1nc(-[#6](-[#7])=O)c2ccccc12
: