Target
Fibroblast growth factor receptor 4
Ligand
BDBM249455
Substrate
FGFR1 substrate peptide
Meas. Tech.
Kinase HotSpot Assay
pH
7.5±n/a
Temperature
298.15±n/a K
IC50
13±n/a nM
Comments
extracted
Citation
 Reynolds, DHao, MWang, JPrajapati, SSatoh, TSelvaraj, A Pyrimidine FGFR4 inhibitors US Patent  US9434697 Publication Date 9/6/2016 
Target
Name:
Fibroblast growth factor receptor 4
Synonyms:
CD_antigen: CD334 FGFR4 FGFR4 Fibroblast growth factor receptor JK2 TKF
Type:
Protein
Mol. Mass.:
87957.45
Organism:
Homo sapiens (Human)
Description:
P22455
Residue:
802
  
Inhibitor
Name:
BDBM249455
Synonyms:
US10537571, Compound 185 US9434697, 185 | US9730931, Compound 185
Type:
Small organic molecule
Emp. Form.:
C23H21Cl2FN6O4
Mol. Mass.:
535.355
SMILES:
COc1cc(OC)c(Cl)c(NC(=O)N(C)c2cc(Nc3cccc(F)c3NC(=O)C=C)ncn2)c1Cl
:
Substrate
Name:
FGFR1 substrate peptide
Synonyms:
Type:
Protein
Mol. Mass.:
1596.80
Organism:
Artificial Organism
Description:
SEQ ID NO:1
Residue:
14
KKKSPGEYVNIEFG