Target
Fibroblast growth factor receptor 1
Ligand
BDBM249419
Substrate
FGFR1 substrate peptide
Meas. Tech.
Kinase HotSpot Assay
pH
7.5±n/a
Temperature
298.15±n/a K
IC50
>10000±n/a nM
Comments
extracted
Citation
 Reynolds, DHao, MWang, JPrajapati, SSatoh, TSelvaraj, A Pyrimidine FGFR4 inhibitors US Patent  US9434697 Publication Date 9/6/2016 
Target
Name:
Fibroblast growth factor receptor 1
Synonyms:
BFGFR Basic fibroblast growth factor receptor 1 (FGFR1) CEK FGFR-1 FGFR-1, (FL) FGFR1_HUMAN FLT2 Fibroblast growth factor receptor 1 (FGFR-1) Fms-like tyrosine kinase 2 N-sam bFGF-R | c-fgr
Type:
Receptor
Mol. Mass.:
91861.70
Organism:
Homo sapiens (Human)
Description:
P11362
Residue:
822
  
Inhibitor
Name:
BDBM249419
Synonyms:
US10537571, Compound 137 US9434697, 137 | US9730931, Compound 137
Type:
Small organic molecule
Emp. Form.:
C27H31Cl2N7O4
Mol. Mass.:
588.486
SMILES:
COc1cc(OC)c(Cl)c(NC(=O)N(C)c2cc(Nc3cc(CCN(C)C)ccc3NC(=O)C=C)ncn2)c1Cl
:
Substrate
Name:
FGFR1 substrate peptide
Synonyms:
Type:
Protein
Mol. Mass.:
1596.80
Organism:
Artificial Organism
Description:
SEQ ID NO:1
Residue:
14
KKKSPGEYVNIEFG