Target
Retinol-binding protein 4
Ligand
BDBM249469
Substrate
Meas. Tech.
Scintillation Proximity Binding Assay
pH
7.4±n/a
Temperature
277.15±n/a K
IC50
<1.371742±n/a nM
Comments
extracted
Citation
 Petrukhin, KCioffi, CJohnson, GAllikmets, RFreeman, EChen, PConlon, MZhu, L Substituted 4-phenylpiperidines, their preparation and use US Patent  US9434727 Publication Date 9/6/2016 
Target
Name:
Retinol-binding protein 4
Synonyms:
PRBP RBP RET4_HUMAN Retinol-binding protein 4 (RBP4) | spa binding assay for rbp4
Type:
Protein
Mol. Mass.:
23008.75
Organism:
Homo sapiens (Human)
Description:
P02753
Residue:
201
  
Inhibitor
Name:
BDBM249469
Synonyms:
US10072016, Compound 68 US10913746, Compound 68 US9434727, 68 | US9777010, Compound 68
Type:
Small organic molecule
Emp. Form.:
C21H22F4N4O3
Mol. Mass.:
454.418
SMILES:
COC(=O)N1CCc2[nH]nc(C(=O)N3CCC(CC3)c3cccc(F)c3C(F)(F)F)c2C1
: