Target
Retinol-binding protein 4
Ligand
BDBM249474
Substrate
Meas. Tech.
Scintillation Proximity Binding Assay
pH
7.4±n/a
Temperature
277.15±n/a K
IC50
8.501059±n/a nM
Comments
extracted
Citation
 Petrukhin, KCioffi, CJohnson, GAllikmets, RFreeman, EChen, PConlon, MZhu, L Substituted 4-phenylpiperidines, their preparation and use US Patent  US9434727 Publication Date 9/6/2016 
Target
Name:
Retinol-binding protein 4
Synonyms:
PRBP RBP RET4_HUMAN Retinol-binding protein 4 (RBP4) | spa binding assay for rbp4
Type:
Protein
Mol. Mass.:
23008.75
Organism:
Homo sapiens (Human)
Description:
P02753
Residue:
201
  
Inhibitor
Name:
BDBM249474
Synonyms:
US10072016, Compound 77 US10913746, Compound 77 US9434727, 73 US9777010, Compound 77
Type:
Small organic molecule
Emp. Form.:
C22H26F4N4O2
Mol. Mass.:
454.4611
SMILES:
COCCN1CCc2c(C1)[nH]nc2C(=O)N1CCC(CC1)c1cccc(F)c1C(F)(F)F
: