Target
Retinol-binding protein 4
Ligand
BDBM249515
Substrate
Meas. Tech.
Scintillation Proximity Binding Assay
pH
7.4±n/a
Temperature
277.15±n/a K
IC50
8.568525±n/a nM
Comments
extracted
Citation
 Petrukhin, KCioffi, CJohnson, GAllikmets, RFreeman, EChen, PConlon, MZhu, L Substituted 4-phenylpiperidines, their preparation and use US Patent  US9434727 Publication Date 9/6/2016 
Target
Name:
Retinol-binding protein 4
Synonyms:
PRBP RBP RET4_HUMAN Retinol-binding protein 4 (RBP4) | spa binding assay for rbp4
Type:
Protein
Mol. Mass.:
23008.75
Organism:
Homo sapiens (Human)
Description:
P02753
Residue:
201
  
Inhibitor
Name:
BDBM249515
Synonyms:
US10072016, Compound 113 US10913746, Compound 113 US9434727, 113 | US9777010, Compound 113
Type:
Small organic molecule
Emp. Form.:
C20H21F5N4O
Mol. Mass.:
428.399
SMILES:
CN1CCc2c(C1)[nH]nc2C(=O)N1CCC(CC1)c1ccc(F)c(F)c1C(F)(F)F
: