Target
Retinol-binding protein 4
Ligand
BDBM249551
Substrate
Meas. Tech.
Scintillation Proximity Binding Assay
pH
7.4±n/a
Temperature
277.15±n/a K
IC50
5.905695±n/a nM
Comments
extracted
Citation
 Petrukhin, KCioffi, CJohnson, GAllikmets, RFreeman, EChen, PConlon, MZhu, L Substituted 4-phenylpiperidines, their preparation and use US Patent  US9434727 Publication Date 9/6/2016 
Target
Name:
Retinol-binding protein 4
Synonyms:
PRBP RBP RET4_HUMAN Retinol-binding protein 4 (RBP4) | spa binding assay for rbp4
Type:
Protein
Mol. Mass.:
23008.75
Organism:
Homo sapiens (Human)
Description:
P02753
Residue:
201
  
Inhibitor
Name:
BDBM249551
Synonyms:
US10072016, Compound 149 US10913746, Compound 149 US9434727, 149 | US9777010, Compound 149
Type:
Small organic molecule
Emp. Form.:
C21H24ClFN4O2
Mol. Mass.:
418.892
SMILES:
Fc1cccc(C2CCN(CC2)C(=O)c2n[nH]c3CN(CCc23)C2COC2)c1Cl
: