Target
Retinol-binding protein 4
Ligand
BDBM249554
Substrate
Meas. Tech.
Scintillation Proximity Binding Assay
pH
7.4±n/a
Temperature
277.15±n/a K
IC50
3.104118±n/a nM
Comments
extracted
Citation
 Petrukhin, KCioffi, CJohnson, GAllikmets, RFreeman, EChen, PConlon, MZhu, L Substituted 4-phenylpiperidines, their preparation and use US Patent  US9434727 Publication Date 9/6/2016 
Target
Name:
Retinol-binding protein 4
Synonyms:
PRBP RBP RET4_HUMAN Retinol-binding protein 4 (RBP4) | spa binding assay for rbp4
Type:
Protein
Mol. Mass.:
23008.75
Organism:
Homo sapiens (Human)
Description:
P02753
Residue:
201
  
Inhibitor
Name:
BDBM249554
Synonyms:
US10072016, Compound 152 US10913746, Compound 152 US9434727, 152 | US9777010, Compound 152
Type:
Small organic molecule
Emp. Form.:
C19H15ClFN5O
Mol. Mass.:
383.807
SMILES:
Fc1cccc(C2CCN(CC2)C(=O)c2nnc3ccc(cn23)C#N)c1Cl
: