Target
C-X-C motif chemokine 10
Ligand
BDBM249602
Substrate
Meas. Tech.
Radioligand Binding Assay
Temperature
298.15±n/a K
IC50
55±n/a nM
Comments
extracted
Citation
 Bata, IBartane Bodor, VVasas, ABuzder-Lantos, PFerenczy, GTomoskozi, ZSzeleczky, GSzamosvolgyi, Z Substituted B-amino acid derivatives as CXCR3 receptor antagonists US Patent  US9447038 Publication Date 9/20/2016 
Target
Name:
C-X-C motif chemokine 10
Synonyms:
C-X-C motif chemokine 10 (CXCL10) CXL10_HUMAN SCYB10
Type:
Enzyme
Mol. Mass.:
10892.04
Organism:
Homo sapiens (Human)
Description:
P02778
Residue:
98
  
Inhibitor
Name:
BDBM249602
Synonyms:
US9447038, 30
Type:
Small organic molecule
Emp. Form.:
C30H38ClN3O5
Mol. Mass.:
556.093
SMILES:
CN1CC(=O)N(CCOc2ccc(CN(CC3CCCCC3)[C@@H](CC(O)=O)c3ccc(Cl)cc3)cc2C)C1=O
: