Target
Galactokinase
Ligand
BDBM249810
Substrate
Meas. Tech.
qHTS Assay
IC50
48516.1±n/a nM
Citation
 Boxer, MBWalsh, MJLiu, LTanega, CDShen, MLai, KTang, MAuld, DS Galactokinase inhibitors for the treatment and prevention of associated diseases and disorders US Patent  US9447087 Publication Date 9/20/2016 
Target
Name:
Galactokinase
Synonyms:
GALK GALK1_HUMAN Galactokinase (GALK) | Galactose kinase
Type:
Enzyme
Mol. Mass.:
42271.26
Organism:
Homo sapiens (Human)
Description:
P51570
Residue:
392
  
Inhibitor
Name:
BDBM249810
Synonyms:
US9447087, 43
Type:
Small organic molecule
Emp. Form.:
C22H20N4O3
Mol. Mass.:
388.4192
SMILES:
COc1ccccc1C1N=C(Nc2nc3ccccc3o2)NC2=C1C(=O)CCC2
: