Target
Tyrosine-protein kinase BTK
Ligand
BDBM249977
Substrate
Meas. Tech.
Time-Resolved Fluorescence Resonance Energy Transfer Assay
Temperature
298.15±n/a K
IC50
1.1±n/a nM
Comments
extracted
Citation
 Wang, ZGuo, Y Substituted pyrazolo[1,5-a]pyrimidines as bruton's tyrosine kinase modulators US Patent  US9447106 Publication Date 9/20/2016 
Target
Name:
Tyrosine-protein kinase BTK
Synonyms:
AGMX1 Agammaglobulinaemia tyrosine kinase B cell progenitor kinase BPK BTK_HUMAN Tyrosine Kinase BTK Tyrosine-protein kinase BTK (BTK)
Type:
Enzyme
Mol. Mass.:
76289.95
Organism:
Homo sapiens (Human)
Description:
Q06187
Residue:
659
  
Inhibitor
Name:
BDBM249977
Synonyms:
US10005782, Compound 103 US9556188, Compound 103
Type:
Small organic molecule
Emp. Form.:
C26H27N5O3
Mol. Mass.:
457.5243
SMILES:
NC(=O)c1c2NCCC(C3CCCN3C(=O)C=C)n2nc1-c1ccc(Oc2ccccc2)cc1
: