Target
Prothrombin
Ligand
BDBM238256
Substrate
Meas. Tech.
Factor Xa and Thrombin Enzyme Assay
IC50
>100000±n/a nM
Citation
 Imagawa, AKondo, TNishiyama, TCourtney, SYarnold, CIchihara, OFlanagan, S Substituted pyrrolidines as factor XIa inhibitors for the treatment thromboembolic diseases US Patent  US9585881 Publication Date 3/7/2017 
Target
Name:
Prothrombin
Synonyms:
Activation peptide fragment 1 Coagulation factor II Prothrombin precursor Thrombin heavy chain | Thrombin light chain
Type:
Protein
Mol. Mass.:
70029.57
Organism:
Homo sapiens (Human)
Description:
P00734
Residue:
622
  
Inhibitor
Name:
BDBM238256
Synonyms:
US10336741, Example 55 US9394250, 55 | US9585881, Example 55
Type:
Small organic molecule
Emp. Form.:
C27H39N5O6S
Mol. Mass.:
561.693
SMILES:
NC[C@H]1CC[C@@H](CC1)C(=O)N1C[C@H](C[C@H]1C(=O)Nc1ccc(cc1)C(O)=O)N1CCN(CC1)S(=O)(=O)C1CC1
: