Target
Prothrombin
Ligand
BDBM238261
Substrate
Meas. Tech.
Factor Xa and Thrombin Enzyme Assay
IC50
40000±n/a nM
Citation
 Imagawa, AKondo, TNishiyama, TCourtney, SYarnold, CIchihara, OFlanagan, S Substituted pyrrolidines as factor XIa inhibitors for the treatment thromboembolic diseases US Patent  US9585881 Publication Date 3/7/2017 
Target
Name:
Prothrombin
Synonyms:
Activation peptide fragment 1 Coagulation factor II Prothrombin precursor Thrombin heavy chain | Thrombin light chain
Type:
Protein
Mol. Mass.:
70029.57
Organism:
Homo sapiens (Human)
Description:
P00734
Residue:
622
  
Inhibitor
Name:
BDBM238261
Synonyms:
US10336741, Example 79 US9394250, 79 | US9585881, Example 79
Type:
Small organic molecule
Emp. Form.:
C29H35ClN8O5S
Mol. Mass.:
643.157
SMILES:
COC(=O)Nc1ccc(cc1)-c1[nH]c(nc1Cl)[C@@H]1C[C@@H](CN1C(=O)c1ccc(NC(N)=N)cc1)C1CCN(CC1)S(C)(=O)=O
: