Target
Prothrombin
Ligand
BDBM238264
Substrate
Meas. Tech.
Factor Xa and Thrombin Enzyme Assay
IC50
>100000±n/a nM
Citation
 Imagawa, AKondo, TNishiyama, TCourtney, SYarnold, CIchihara, OFlanagan, S Substituted pyrrolidines as factor XIa inhibitors for the treatment thromboembolic diseases US Patent  US9585881 Publication Date 3/7/2017 
Target
Name:
Prothrombin
Synonyms:
Activation peptide fragment 1 Coagulation factor II Prothrombin precursor Thrombin heavy chain | Thrombin light chain
Type:
Protein
Mol. Mass.:
70029.57
Organism:
Homo sapiens (Human)
Description:
P00734
Residue:
622
  
Inhibitor
Name:
BDBM238264
Synonyms:
US10336741, Example 93 US9394250, 93 | US9585881, Example 93
Type:
Small organic molecule
Emp. Form.:
C28H30ClFN4O6S
Mol. Mass.:
605.077
SMILES:
Cn1cc(Cl)c2c(F)c(ccc12)C(=O)N1C[C@H](C[C@H]1C(=O)Nc1ccc(cc1)C(O)=O)C1CCN(CC1)S(C)(=O)=O
: