Target
Coagulation factor XI
Ligand
BDBM238259
Substrate
Meas. Tech.
Factor XIa Enzyme Assay
IC50
2.20±n/a nM
Citation
 Imagawa, AKondo, TNishiyama, TCourtney, SYarnold, CIchihara, OFlanagan, S Substituted pyrrolidines as factor XIa inhibitors for the treatment thromboembolic diseases US Patent  US9585881 Publication Date 3/7/2017 
Target
Name:
Coagulation factor XI
Synonyms:
Coagulation factor XIa Coagulation factor XIa light chain FA11_HUMAN Factor XIa PTA | Plasma thromboplastin antecedent
Type:
Enzyme
Mol. Mass.:
70130.58
Organism:
Homo sapiens (Human)
Description:
P03951
Residue:
625
  
Inhibitor
Name:
BDBM238259
Synonyms:
US10336741, Example 71 US9394250, 71 | US9585881, Example 71
Type:
Small organic molecule
Emp. Form.:
C28H39ClN8O5S
Mol. Mass.:
635.178
SMILES:
COC(=O)Nc1ccc(cc1)-c1[nH]c(nc1Cl)[C@@H]1C[C@@H](CN1C(=O)C1CCN(CC1)C(N)=N)C1CCN(CC1)S(C)(=O)=O
: