Target
Trace amine-associated receptor 1
Ligand
BDBM250092
Substrate
Meas. Tech.
Radioligand Binding Assay
pH
7.4±n/a
Temperature
310.15±n/a K
Ki
0.6±n/a nM
Comments
extracted
Citation
 Groebke Zbinden, KNorcross, RPflieger, P Substituted benzamides US Patent  US9452980 Publication Date 9/27/2016 
Target
Name:
Trace amine-associated receptor 1
Synonyms:
TAAR1_MOUSE Taar1 Trace amine receptor 1 (TARR1) Trace amine-associated receptor1 | Trar1
Type:
Protein
Mol. Mass.:
37635.41
Organism:
Mus musculus (Mouse)
Description:
Q923Y8
Residue:
332
  
Inhibitor
Name:
BDBM250092
Synonyms:
US10501411, Example 2 US9452980, 2
Type:
Small organic molecule
Emp. Form.:
C18H20Cl2N4O
Mol. Mass.:
379.284
SMILES:
CN1CCN(CC1)c1ccc(NC(=O)Nc2ccc(Cl)c(Cl)c2)cc1
: