Target
11-beta-hydroxysteroid dehydrogenase 1
Ligand
BDBM250479
Substrate
Meas. Tech.
HTRF Assay
pH
6±n/a
Temperature
298.15±n/a K
IC50
51.2±n/a nM
Comments
extracted
Citation
 Ahn, SKAuh, JChoi, NSHan, CKKim, TPae, KShin, YJHan, DHan, CK Compound having ability to inhibit 11Beta-HSD1 enzyme or pharmaceutically acceptable salt thereof, method for producing same, and pharmaceutical composition containing same as active ingredient US Patent  US9464044 Publication Date 10/11/2016 
Target
Name:
11-beta-hydroxysteroid dehydrogenase 1
Synonyms:
11-DH 11-beta-Hydroxysteroid Dehydrogenase 1 (11-beta-HSD1) 11-beta-hydroxysteroid dehydrogenase 1 (11HSD1) Corticosteroid 11-beta-dehydrogenase isozyme 1 (11-beta-HSD-1) Corticosteroid 11-beta-dehydrogenase isozyme 1 (11beta-HSD1) HSD11 HSD11L | SDR26C1
Type:
Enzyme
Mol. Mass.:
32409.16
Organism:
Homo sapiens (Human)
Description:
P28845
Residue:
292
  
Inhibitor
Name:
BDBM250479
Synonyms:
US9464044, 108
Type:
Small organic molecule
Emp. Form.:
C23H29N5O4S
Mol. Mass.:
471.572
SMILES:
Cc1n[nH]c(C)c1S(=O)(=O)Nc1cccc(c1)C(=O)N[C@H]1C2CC3CC1CC(C3)(C2)C(N)=O
: