Target
Prokineticin receptor 1
Ligand
BDBM250577
Substrate
Meas. Tech.
Biological Assay
pH
7.4±n/a
Temperature
310.15±n/a K
IC50
950±n/a nM
Comments
extracted
Citation
 Carroll, CGoldby, ATeall, M Sulfonyl piperidine derivatives and their use for treating prokineticin mediated diseases US Patent  US9475795 Publication Date 10/25/2016 
Target
Name:
Prokineticin receptor 1
Synonyms:
G-protein coupled receptor 73 GPR73 PK-R1 PKR1_HUMAN | PROKR1
Type:
enzyme
Mol. Mass.:
44779.92
Organism:
Homo sapiens (Human)
Description:
Q8TCW9
Residue:
393
  
Inhibitor
Name:
BDBM250577
Synonyms:
US10167273, Example 56 US11512066, Example 56 | US9475795, 56
Type:
Small organic molecule
Emp. Form.:
C18H23Cl2N3O2S
Mol. Mass.:
416.365
SMILES:
Cc1nn(C)c(C)c1S(=O)(=O)N1CCC(Cc2ccc(Cl)c(Cl)c2)CC1
: