Target
Carbonic anhydrase
Ligand
BDBM62293
Substrate
Meas. Tech.
ChEMBL_158311 (CHEMBL763368)
pH
7.5±n/a
Temperature
293.15±n/a K
Ki
9500000±n/a nM
Citation
 Del Prete, SVullo, DDe Luca, VCarginale, Vdi Fonzo, POsman, SMAlOthman, ZSupuran, CTCapasso, C Anion inhibition profiles of a-, ß- and ¿-carbonic anhydrases from the pathogenic bacterium Vibrio cholerae. Bioorg Med Chem 24:3413-7 (2016)  
Target
Name:
Carbonic anhydrase
Synonyms:
Beta-carbonic anhydrase | VchβCA
Type:
Protein
Mol. Mass.:
25222.79
Organism:
Vibrio cholerae
Description:
A0A086SLX8
Residue:
222
  
Inhibitor
Name:
BDBM62293
Synonyms:
SCN- | thiocyanate ion
Type:
Emp. Form.:
CNS
Mol. Mass.:
58.083
SMILES:
[S-]C#N
: