Target
Gamma carbonic anhydrase family protein
Ligand
BDBM50278319
Substrate
Meas. Tech.
ChEMBL_158313 (CHEMBL763370)
pH
7.5±n/a
Temperature
293.15±n/a K
Ki
>200000000±n/a nM
Citation
 Del Prete, SVullo, DDe Luca, VCarginale, Vdi Fonzo, POsman, SMAlOthman, ZSupuran, CTCapasso, C Anion inhibition profiles of a-, ß- and ¿-carbonic anhydrases from the pathogenic bacterium Vibrio cholerae. Bioorg Med Chem 24:3413-7 (2016)  
Target
Name:
Gamma carbonic anhydrase family protein
Synonyms:
Gamma-carbonic anhydrase | VchγCA
Type:
Protein
Mol. Mass.:
19753.38
Organism:
Vibrio cholerae
Description:
A0A0H7HLM5
Residue:
183
  
Inhibitor
Name:
BDBM50278319
Synonyms:
CHEMBL502764 | sodium persulfate
Type:
Small organic molecule
Emp. Form.:
O8S2
Mol. Mass.:
192.126
SMILES:
[O-]S(=O)(=O)OOS([O-])(=O)=O
: