Target
Melanocortin receptor 4
Ligand
BDBM250696
Substrate
Meas. Tech.
Competitive Inhibition Binding Assay
pH
7.5±n/a
Temperature
310.15±n/a K
Ki
10000±n/a nM
Comments
extracted
Citation
 Yang, WShi, Y Melanocortin-1 receptor-specific cyclic peptides US Patent  US9447148 Publication Date 9/20/2016 
Target
Name:
Melanocortin receptor 4
Synonyms:
MC4-R MC4R_HUMAN Melanocortin receptor 4 (MC-4) Melanocortin receptor 4 (MC4R)
Type:
Enzyme
Mol. Mass.:
36949.50
Organism:
Homo sapiens (Human)
Description:
P32245
Residue:
332
  
Inhibitor
Name:
BDBM250696
Synonyms:
US9447148, 9.65
Type:
Small organic molecule
Emp. Form.:
C37H57N11O8
Mol. Mass.:
783.9174
SMILES:
CCCC[C@H](NC(C)=O)C(=O)N[C@H]1CCC(=O)NCC[C@H](NC(=O)[C@H](CCCNC(N)=N)NC(=O)[C@@H](Cc2ccccc2)NC(=O)[C@@H]2CCCN2C1=O)C(N)=O
: