Target
Melanocyte-stimulating hormone receptor
Ligand
BDBM250664
Substrate
Meas. Tech.
Competitive Inhibition Binding Assay
pH
7.5±n/a
Temperature
310.15±n/a K
Ki
645±n/a nM
Comments
extracted
Citation
 Yang, WShi, Y Melanocortin-1 receptor-specific cyclic peptides US Patent  US9447148 Publication Date 9/20/2016 
Target
Name:
Melanocyte-stimulating hormone receptor
Synonyms:
MC1-R MSH-R MSHR_HUMAN Melanocortin receptor (M1 and M4) Melanocortin receptor 1 (MC1-R) | Melanocortin receptor 1 (MC1R)
Type:
Enzyme
Mol. Mass.:
34717.23
Organism:
Homo sapiens (Human)
Description:
Q01726
Residue:
317
  
Inhibitor
Name:
BDBM250664
Synonyms:
US9447148, 9.33 | US9447148, 9.45
Type:
Small organic molecule
Emp. Form.:
C35H50N10O8
Mol. Mass.:
738.8337
SMILES:
CCCC[C@H](NC(C)=O)C(=O)N[C@H]1CCC(=O)NCC[C@H](NC(=O)[C@H](C)NC(=O)[C@@H](Cc2ccccc2)NC(=O)[C@H](Cc2c[nH]cn2)NC1=O)C(N)=O
: