Target
Melanin-concentrating hormone receptor 1
Ligand
BDBM294175
Substrate
Meas. Tech.
Radioligand Binding Assay
pH
7.4±n/a
Ki
11.0±n/a nM
Comments
extracted
Citation
 Ahmad, SZhao, GWashburn, WN Pyrrolone or pyrrolidinone melanin concentrating hormone receptor-1 antagonists US Patent  US9586900 Publication Date 3/7/2017 
Target
Name:
Melanin-concentrating hormone receptor 1
Synonyms:
G-protein coupled receptor 24 MCH receptor 1 MCH-R1 MCHR-1 MCHR1_HUMAN Melanin-Concentrating Hormone Receptor 1 (MCH1R) Melanin-concentrating hormone receptor 1 (MCH-1) Melanin-concentrating hormone receptor 1 (MCHR-1) SLC-1 Somatostatin receptor-like protein
Type:
G Protein-Coupled Receptor (GPCR)
Mol. Mass.:
45976.27
Organism:
Homo sapiens (Human)
Description:
Membranes from CHO-K1 cells stably expressing human MCH1R were used in assays.
Residue:
422
  
Inhibitor
Name:
BDBM294175
Synonyms:
US9586900, Example 79
Type:
Small organic molecule
Emp. Form.:
C22H24F3NO5
Mol. Mass.:
439.4249
SMILES:
Cc1cc(ccc1OCC(C)(C)O)N1CC[C@@H](Oc2ccc(OC(F)(F)F)cc2)C1=O
: