Target
Cobra venom factor/Complement factor B/Complement factor D
Ligand
BDBM251420
Substrate
Complement C3
Meas. Tech.
ELISA Assay
pH
7.4±n/a
Temperature
298.15±n/a K
IC50
1±n/a nM
Comments
extracted
Citation
 Dechantsreiter, MGrob, JEMacsweeney, AMiltz, WRandl, SASedrani, RSellner, HSirockin, FValeur, E Complement pathway modulators and uses thereof US Patent  US9452990 Publication Date 9/27/2016 
Target
Name:
Cobra venom factor/Complement factor B/Complement factor D
Synonyms:
CVF-Bb Complex | Complement factor B
Type:
Enzyme
Mol. Mass.:
Description:
Components:
This complex has 3 components.
Component 1
Name:
Cobra venom factor
Synonyms:
VCO3_NAJKA
Type:
Enzyme
Mol. Mass.:
184512.00
Organism:
Naja kaouthia (Monocled cobra) (Naja siamensis)
Description:
Q91132
Residue:
1642
  
Component 2
Name:
Complement factor B
Synonyms:
BF CFAB_HUMAN | CFB
Type:
Enzyme
Mol. Mass.:
85537.97
Organism:
Homo sapiens (Human)
Description:
P00751
Residue:
764
  
Component 3
Name:
Complement factor D
Synonyms:
Adipsin CFAD_HUMAN DF Properdin factor D
Type:
Protein
Mol. Mass.:
27039.19
Organism:
Homo sapiens (Human)
Description:
P00746
Residue:
253
  
Inhibitor
Name:
BDBM251420
Synonyms:
US9452990, 102
Type:
Small organic molecule
Emp. Form.:
C29H34FN7O4
Mol. Mass.:
563.6232
SMILES:
COc1cc2c(N)nc(nc2c(F)c1OC)N1CCN(CC1)C(=O)C[C@@H](NCC1(C)COC1)c1ccc(cc1)C#N
:
Substrate
Name:
Complement C3
Synonyms:
C3 CPAMD1
Type:
Enzyme
Mol. Mass.:
187142.34
Organism:
Homo sapiens (Human)
Description:
P01024
Residue:
1663