Target
Protein kinase C alpha type
Ligand
BDBM251523
Substrate
Meas. Tech.
In Vitro Inhibition Activity Assay
pH
7.4±n/a
IC50
0.13±n/a nM
Comments
extracted
Citation
 Visser, MSLuzzio, MJPapillon, J Protein kinase C inhibitors and methods of their use US Patent  US9452998 Publication Date 9/27/2016 
Target
Name:
Protein kinase C alpha type
Synonyms:
KPCA_HUMAN PKC alpha and beta-2 PKC-alpha PRKACA Protein Kinase C- alpha Protein kinase C alpha (PKCa) Protein kinase C alpha type (PRKCA) RAF proto-oncogene serine/threonine-protein kinase
Type:
Enzyme
Mol. Mass.:
76755.65
Organism:
Homo sapiens (Human)
Description:
The recombinant human PKC enzymes were produced using a baculovirus expression system in SF9 cells
Residue:
672
  
Inhibitor
Name:
BDBM251523
Synonyms:
US9452998, 72 | US9452998, 78
Type:
Small organic molecule
Emp. Form.:
C28H31N9O2
Mol. Mass.:
525.6048
SMILES:
NC1CCN(CC1)c1cccnc1NC(=O)c1nc(cnc1N)-c1nc(cc2ccccc12)N1CCOCC1
: