Target
Protein kinase C alpha type
Ligand
BDBM251559
Substrate
Meas. Tech.
In Vitro Inhibition Activity Assay
pH
7.4±n/a
IC50
0.32±n/a nM
Comments
extracted
Citation
 Visser, MSLuzzio, MJPapillon, J Protein kinase C inhibitors and methods of their use US Patent  US9452998 Publication Date 9/27/2016 
Target
Name:
Protein kinase C alpha type
Synonyms:
KPCA_HUMAN PKC alpha and beta-2 PKC-alpha PRKACA Protein Kinase C- alpha Protein kinase C alpha (PKCa) Protein kinase C alpha type (PRKCA) RAF proto-oncogene serine/threonine-protein kinase
Type:
Enzyme
Mol. Mass.:
76755.65
Organism:
Homo sapiens (Human)
Description:
The recombinant human PKC enzymes were produced using a baculovirus expression system in SF9 cells
Residue:
672
  
Inhibitor
Name:
BDBM251559
Synonyms:
US9452998, 108
Type:
Small organic molecule
Emp. Form.:
C27H32F3N9O2
Mol. Mass.:
571.5973
SMILES:
C[C@H]1COCCN1c1ccc(c(n1)-c1cnc(N)c(n1)C(=O)Nc1ncccc1N1CCC(C)(N)CC1)C(F)(F)F
: