Target
Serine/threonine-protein kinase mTOR [1360-2549]
Ligand
BDBM251578
Substrate
Meas. Tech.
LanthaScreen Kinase Activity Assay
pH
7.5±n/a
Temperature
298.15±n/a K
IC50
146±n/a nM
Comments
extracted
Target
Name:
Serine/threonine-protein kinase mTOR [1360-2549]
Synonyms:
FRAP FRAP2 MTOR_HUMAN RAPT1 | Serine/threonine-protein kinase mTOR
Type:
Enzyme
Mol. Mass.:
136306.16
Organism:
Homo sapiens (Human)
Description:
aa 1360-2549
Residue:
1190
  
Inhibitor
Name:
BDBM251578
Synonyms:
US9453031, 1
Type:
Small organic molecule
Emp. Form.:
C21H24N4O4S
Mol. Mass.:
428.505
SMILES:
CC(C)(c1nc(nc2N3CCOCC3COc12)-c1cccc2[nH]ccc12)S(C)(=O)=O
: