Target
Serine/threonine-protein kinase mTOR [1360-2549]
Ligand
BDBM251583
Substrate
Meas. Tech.
LanthaScreen Kinase Activity Assay
pH
7.5±n/a
Temperature
298.15±n/a K
IC50
558±n/a nM
Comments
extracted
Target
Name:
Serine/threonine-protein kinase mTOR [1360-2549]
Synonyms:
FRAP FRAP2 MTOR_HUMAN RAPT1 | Serine/threonine-protein kinase mTOR
Type:
Enzyme
Mol. Mass.:
136306.16
Organism:
Homo sapiens (Human)
Description:
aa 1360-2549
Residue:
1190
  
Inhibitor
Name:
BDBM251583
Synonyms:
US9453031, 6
Type:
Small organic molecule
Emp. Form.:
C21H22N4O4S
Mol. Mass.:
426.489
SMILES:
CS(=O)(=O)C1(CC1)c1nc(nc2N3CCOC[C@H]3COc12)-c1cccc2[nH]ccc12
: