Target
Serine/threonine-protein kinase mTOR [1360-2549]
Ligand
BDBM251619
Substrate
Meas. Tech.
LanthaScreen Kinase Activity Assay
pH
7.5±n/a
Temperature
298.15±n/a K
IC50
412±n/a nM
Comments
extracted
Target
Name:
Serine/threonine-protein kinase mTOR [1360-2549]
Synonyms:
FRAP FRAP2 MTOR_HUMAN RAPT1 | Serine/threonine-protein kinase mTOR
Type:
Enzyme
Mol. Mass.:
136306.16
Organism:
Homo sapiens (Human)
Description:
aa 1360-2549
Residue:
1190
  
Inhibitor
Name:
BDBM251619
Synonyms:
US9453031, 42
Type:
Small organic molecule
Emp. Form.:
C25H21N5O2
Mol. Mass.:
423.4665
SMILES:
C1CN2C(CO1)COc1c2nc(nc1-c1cccc2[nH]ccc12)-c1cccc2[nH]ccc12
: