Target
Lysophosphatidic acid receptor 5
Ligand
BDBM251693
Substrate
Meas. Tech.
Receptor Assay
Temperature
310.15±n/a K
IC50
43±n/a nM
Comments
extracted
Citation
 Buffham, WCanning, HDavenport, RFarnaby, WMack, SParmar, AWright, S Compounds US Patent  US9464060 Publication Date 10/11/2016 
Target
Name:
Lysophosphatidic acid receptor 5
Synonyms:
GPR92 LPAR5 Lysophosphatidic acid receptor 5 | Lysophosphatidic acid receptor 5 (LPA5)
Type:
Enzyme
Mol. Mass.:
41372.36
Organism:
Homo sapiens (Human)
Description:
Q9H1C0
Residue:
372
  
Inhibitor
Name:
BDBM251693
Synonyms:
US10100018, Example 29 | US9464060, 29
Type:
Small organic molecule
Emp. Form.:
C24H21F2NO5
Mol. Mass.:
441.424
SMILES:
COc1ccccc1Oc1ccc(cc1)C(=O)N(CC(F)F)Cc1ccc(cc1)C(O)=O
: