Target
Lysophosphatidic acid receptor 5
Ligand
BDBM251708
Substrate
Meas. Tech.
Receptor Assay
Temperature
310.15±n/a K
IC50
11±n/a nM
Comments
extracted
Citation
 Buffham, WCanning, HDavenport, RFarnaby, WMack, SParmar, AWright, S Compounds US Patent  US9464060 Publication Date 10/11/2016 
Target
Name:
Lysophosphatidic acid receptor 5
Synonyms:
GPR92 LPAR5 Lysophosphatidic acid receptor 5 | Lysophosphatidic acid receptor 5 (LPA5)
Type:
Enzyme
Mol. Mass.:
41372.36
Organism:
Homo sapiens (Human)
Description:
Q9H1C0
Residue:
372
  
Inhibitor
Name:
BDBM251708
Synonyms:
US10100018, Example 44 | US9464060, 44
Type:
Small organic molecule
Emp. Form.:
C28H21ClFNO4
Mol. Mass.:
489.922
SMILES:
OC(=O)c1ccc(CN(Cc2ccccc2)C(=O)c2ccc(Oc3c(F)cccc3Cl)cc2)cc1
: