Target
Lysophosphatidic acid receptor 5
Ligand
BDBM251743
Substrate
Meas. Tech.
Receptor Assay
Temperature
310.15±n/a K
IC50
68±n/a nM
Comments
extracted
Citation
 Buffham, WCanning, HDavenport, RFarnaby, WMack, SParmar, AWright, S Compounds US Patent  US9464060 Publication Date 10/11/2016 
Target
Name:
Lysophosphatidic acid receptor 5
Synonyms:
GPR92 LPAR5 Lysophosphatidic acid receptor 5 | Lysophosphatidic acid receptor 5 (LPA5)
Type:
Enzyme
Mol. Mass.:
41372.36
Organism:
Homo sapiens (Human)
Description:
Q9H1C0
Residue:
372
  
Inhibitor
Name:
BDBM251743
Synonyms:
US10100018, Example 79 | US9464060, 79
Type:
Small organic molecule
Emp. Form.:
C26H24FNO5
Mol. Mass.:
449.4709
SMILES:
COc1ccc(F)cc1Oc1ccc(cc1)C(=O)N(CC1CC1)Cc1ccc(cc1)C(O)=O
: