Target
Lysophosphatidic acid receptor 1
Ligand
BDBM251677
Substrate
Meas. Tech.
Receptor Assay
Temperature
310.15±n/a K
IC50
4±n/a nM
Comments
extracted
Citation
 Buffham, WCanning, HDavenport, RFarnaby, WMack, SParmar, AWright, S Compounds US Patent  US9464060 Publication Date 10/11/2016 
Target
Name:
Lysophosphatidic acid receptor 1
Synonyms:
EDG2 LPA-1 LPAR1 Lysophosphatidic acid receptor 1 (LPA1) | Lysophosphatidic acid receptor Edg-2
Type:
Enzyme
Mol. Mass.:
41120.55
Organism:
Homo sapiens (Human)
Description:
Q92633
Residue:
364
  
Inhibitor
Name:
BDBM251677
Synonyms:
US10100018, Example 13 | US9464060, 13
Type:
Small organic molecule
Emp. Form.:
C29H24FNO5
Mol. Mass.:
485.503
SMILES:
COc1cccc(CN(Cc2ccc(cc2)C(O)=O)C(=O)c2ccc(Oc3ccccc3F)cc2)c1
: