Target
Lysophosphatidic acid receptor 1
Ligand
BDBM251686
Substrate
Meas. Tech.
Receptor Assay
Temperature
310.15±n/a K
IC50
30±n/a nM
Comments
extracted
Citation
 Buffham, WCanning, HDavenport, RFarnaby, WMack, SParmar, AWright, S Compounds US Patent  US9464060 Publication Date 10/11/2016 
Target
Name:
Lysophosphatidic acid receptor 1
Synonyms:
EDG2 LPA-1 LPAR1 Lysophosphatidic acid receptor 1 (LPA1) | Lysophosphatidic acid receptor Edg-2
Type:
Enzyme
Mol. Mass.:
41120.55
Organism:
Homo sapiens (Human)
Description:
Q92633
Residue:
364
  
Inhibitor
Name:
BDBM251686
Synonyms:
US10100018, Example 22 | US9464060, 22
Type:
Small organic molecule
Emp. Form.:
C26H25NO4
Mol. Mass.:
415.481
SMILES:
Cc1ccccc1Oc1ccc(cc1)C(=O)N(CC1CC1)Cc1ccc(cc1)C(O)=O
: